{"text_format":"1","workbook":"xlsx","n_sheets":3,"sheets":["01 促進計画書 様式","11 促進計画書 記入例(機構経由 )","21 促進計画書 記入例(機構非経由 )"],"not_rendered":{"charts":0,"images":1,"macros":0,"external_links":0,"defined_names":4,"comments":0,"pivot_tables":0},"unopened":[],"bounds":{"document_bytes":16777216,"sheet_cells":100000,"rows_first":2000,"rows_last":500,"rows_between":2000,"halvings":0,"cell_chars":16384,"cell_head_chars":4096},"cells_cut":0,"cells_raw":0,"read":"whole","date_system":"1900"}

{"sheet":"01 促進計画書 様式","index":0,"n_rows":69,"n_cols":51,"rows_kept":69,"cut":false,"hidden":false,"merged":[[1,43,1,51],[2,18,3,39],[2,42,3,42],[2,43,3,51],[3,2,4,14],[5,2,6,4],[5,5,5,23],[5,26,5,27],[5,28,5,32],[5,33,5,46],[5,48,5,49],[5,50,5,51],[6,6,6,13],[6,14,6,17],[6,18,6,27],[6,28,7,32],[6,34,6,40],[6,41,6,43],[6,44,6,51],[7,5,7,8],[7,9,7,27],[7,33,7,36],[7,37,7,51],[8,2,8,4],[8,5,8,8],[8,9,8,23],[8,24,8,27],[8,28,10,29],[8,30,9,32],[8,33,8,36],[8,37,8,46],[8,47,8,51],[9,2,9,4],[9,5,10,8],[9,9,10,23],[9,24,11,27],[9,33,10,36],[9,37,10,46],[9,47,11,51],[10,30,10,32],[13,45,15,48],[13,49,15,51],[14,2,15,2],[14,3,14,7],[14,8,14,16],[14,18,15,18],[14,19,15,21],[14,22,14,26],[11,5,11,8],[11,9,11,23],[11,28,11,32],[11,33,11,36],[11,37,11,46],[12,2,12,17],[14,27,14,30],[14,31,15,31],[14,32,15,36],[14,37,14,44],[15,14,15,17],[15,22,15,24],[15,25,15,26],[15,27,15,30],[13,2,13,26],[13,31,13,44],[15,37,15,41],[15,42,15,44],[16,1,20,1],[16,2,21,2],[16,14,21,17],[16,18,21,18],[16,19,21,21],[16,22,21,24],[16,25,21,26],[16,27,18,30],[15,10,15,13],[15,3,15,9],[16,10,21,13],[16,3,21,9],[22,37,27,41],[22,42,27,44],[22,45,27,48],[22,49,27,51],[24,32,25,36],[19,27,21,30],[20,32,21,36],[22,1,26,1],[22,2,27,2],[22,14,27,17],[22,18,27,18],[22,19,27,21],[22,22,27,24],[22,25,27,26],[22,27,24,30],[16,31,21,31],[16,32,17,36],[16,37,21,41],[16,42,21,44],[16,45,21,48],[16,49,21,51],[18,32,19,36],[25,27,27,30],[26,32,27,36],[28,1,32,1],[28,2,33,2],[28,14,33,17],[28,18,33,18],[28,19,33,21],[28,22,33,24],[28,25,33,26],[28,27,30,30],[22,31,27,31],[22,10,27,13],[28,10,33,13],[22,3,27,9],[28,3,33,9],[22,32,23,36],[34,37,39,41],[34,42,39,44],[34,45,39,48],[34,49,39,51],[36,32,37,36],[31,27,33,30],[32,32,33,36],[34,1,38,1],[34,2,39,2],[34,14,39,17],[34,18,39,18],[34,19,39,21],[34,22,39,24],[34,25,39,26],[34,27,36,30],[28,31,33,31],[28,32,29,36],[28,37,33,41],[28,42,33,44],[28,45,33,48],[28,49,33,51],[30,32,31,36],[37,27,39,30],[40,42,45,44],[40,45,45,48],[40,49,45,51],[42,32,43,36],[40,10,45,13],[38,32,39,36],[40,1,44,1],[40,2,45,2],[40,14,45,17],[40,18,45,18],[40,19,45,21],[40,22,45,24],[40,25,45,26],[40,27,42,30],[34,31,39,31],[34,32,35,36],[34,10,39,13],[34,3,39,9],[40,3,45,9],[43,27,45,30],[44,32,45,36],[40,32,41,36],[46,14,51,17],[46,18,51,18],[46,19,51,21],[46,22,51,24],[46,25,51,26],[46,27,48,30],[46,31,51,31],[40,31,45,31],[40,37,45,41],[52,37,57,41],[52,42,57,44],[52,45,57,48],[52,49,57,51],[54,32,55,36],[49,27,51,30],[50,32,51,36],[52,2,57,2],[52,14,57,17],[52,18,57,18],[52,19,57,21],[52,22,57,24],[52,25,57,26],[52,27,54,30],[52,31,57,31],[46,10,51,13],[46,3,51,9],[46,32,47,36],[46,37,51,41],[46,42,51,44],[46,45,51,48],[46,49,51,51],[48,32,49,36],[46,2,51,2],[60,32,61,36],[55,27,57,30],[56,32,57,36],[58,2,63,2],[58,14,63,17],[58,18,63,18],[58,19,63,21],[58,22,63,24],[58,25,63,26],[58,27,60,30],[58,31,63,31],[52,3,57,9],[52,10,57,13],[52,32,53,36],[64,41,64,51],[65,24,65,40],[65,41,65,51],[67,2,67,22],[67,23,67,51],[68,2,68,22],[68,23,68,51],[61,27,63,30],[62,32,63,36],[64,2,65,5],[64,6,65,11],[64,12,65,12],[64,13,65,16],[64,17,65,19],[64,20,65,20],[64,21,65,23],[64,24,64,40],[58,3,63,9],[58,10,63,13],[58,32,59,36],[58,37,63,41],[58,42,63,44],[58,45,63,48],[58,49,63,51]]}
[]
[null,null,null,null,null,null,null,null,null,null,null,null,null,null,null,null,null,null,null,null,null,null,null,null,null,null,null,null,null,null,null,null,null,null,null,null,null,null,null,null,null,null,null,"機構を経由し賃料のやり取りを行う場合"]
[null,null,null,null,null,null,null,null,null,null,null,null,null,null,null,null,null,null,"農用地利用集積等促進計画（兼申出書）",null,null,null,null,null,null,null,null,null,null,null,null,null,null,null,null,null,null,null,null,null,null,null,null,"物納など、出し手と受け手とで直接賃料の\nやり取りを行う場合"]
[null,null,"１　権利の設定関係"]
[]
[null,null,"整理\n番号\n（受_出）",null,null,"利用権の設定をする者 （出し手）",null,null,null,null,null,null,null,null,null,null,null,null,null,null,null,null,null,null,"〔№",null,"〕",null,"農地中間管理機構",null,null,null,null,"利用権の設定を受ける者 （受け手）",null,null,null,null,null,null,null,null,null,null,null,null,null,"〔№",null,null,"〕"]
[null,null,null,null,null,"〒",null,null,null,null,null,null,null,null,"℡(携帯) ",null,null,null,null,null,null,null,null,null,null,null,null,null,"〒 810-0001\n　　福岡市中央区天神4-10-12",null,null,null,null,"〒",null,null,null,null,null,null,null,"℡(携帯) "]
[null,1,null,null,null,"住 所",null,null,null,null,null,null,null,null,null,null,null,null,null,null,null,null,null,null,null,null,null,null,null,null,null,null,null,"住 所"]
[null,null,null,null,null,"ﾌﾘｶﾞﾅ ",null,null,null,null,null,null,null,null,null,null,null,null,null,null,null,null,null,null,"［ 同意印又は署名 ］",null,null,null,"名称",null,"公益財団法人\n 福岡県農業振興推進機構",null,null,"ﾌﾘｶﾞﾅ ",null,null,null,null,null,null,null,null,null,null,null,null,null,"［ 同意印又は署名 ］"]
[null,null,"項",null,null,"氏名\n・名称",null,null,null,null,null,null,null,null,null,null,null,null,null,null,null,null,null,null,null,null,null,null,null,null,null,null,null,"氏名\n・名称"]
[null,null,null,null,null,null,null,null,null,null,null,null,null,null,null,null,null,null,null,null,null,null,null,null,null,null,null,null,null,null,"理事長　 鐘 江 義 広"]
[null,null,null,"/",null,"e-mail",null,null,null,null,null,null,null,null,null,null,null,null,null,null,null,null,null,null,null,null,null,null," 電話番号 :092-716-8355 ",null,null,null,null,"e-mail"]
[null,null,"２　権利を設定する農用地の明細"]
[null,null,"利用権を設定する土地",null,null,null,null,null,null,null,null,null,null,null,null,null,null,null,null,null,null,null,null,null,null,null,null,null,null,null,null,"設定する利用権の内容",null,null,null,null,null,null,null,null,null,null,null,null,null,"備　考",null,null,null,"賃　　料\n端数処理"]
[null,null,"番号","市町村 〔",null,null,null,null,null,null,null,null,null,null,null,null,null,"〕","区分","現況\n地目",null,null,"面積（㎡）",null,null,null,null,"始期",null,null,null,"存続\n期間","権利の種類",null,null,null,null,"賃 料（円）"]
[null,null,null,"大　字",null,null,null,null,null,null,"字",null,null,null,"地　番",null,null,null,null,null,null,null,"台帳",null,null,"取扱",null,"終期",null,null,null,null,null,null,null,null,null,"10a当たり",null,null,null,null,"年 額"]
[null,null,1,null,null,null,null,null,null,null,null,null,null,null,null,null,null,null,null,null,null,null,null,null,null,null,null,"R　　　年　　月　　日",null,null,null,null," □ 金納"]
[]
[null,null,null,null,null,null,null,null,null,null,null,null,null,null,null,null,null,null,null,null,null,null,null,null,null,null,null,null,null,null,null,null," □ 物納"]
[null,null,null,null,null,null,null,null,null,null,null,null,null,null,null,null,null,null,null,null,null,null,null,null,null,null,null,"R　　　年　　月　　日"]
{"$rows_left_out":50}
{"sheet":"11 促進計画書 記入例(機構経由 )","index":1,"n_rows":70,"n_cols":57,"rows_kept":70,"cut":false,"hidden":false,"merged":[[2,43,2,51],[3,18,4,39],[3,42,4,42],[3,43,4,51],[4,2,5,14],[6,2,7,4],[6,5,6,23],[6,26,6,27],[6,28,6,32],[6,33,6,46],[6,48,6,49],[6,50,6,51],[7,6,7,13],[7,14,7,17],[7,18,7,27],[7,28,8,32],[7,34,7,40],[7,41,7,43],[7,44,7,51],[8,5,8,8],[8,9,8,27],[8,33,8,36],[8,37,8,51],[12,37,12,46],[13,2,13,17],[9,37,9,46],[9,47,9,51],[10,2,10,4],[10,5,11,8],[10,9,11,23],[10,24,12,27],[10,33,11,36],[10,37,11,46],[10,47,12,51],[11,30,11,32],[9,2,9,4],[9,5,9,8],[9,9,9,23],[9,24,9,27],[9,28,11,29],[9,30,10,32],[9,33,9,36],[12,5,12,8],[12,9,12,23],[12,28,12,32],[12,33,12,36],[14,49,16,51],[15,8,15,16],[15,18,16,18],[15,19,16,21],[15,22,15,26],[15,27,15,30],[15,31,16,31],[15,32,16,36],[15,37,15,44],[16,14,16,17],[16,22,16,24],[16,25,16,26],[16,27,16,30],[16,37,16,41],[16,42,16,44],[17,1,21,1],[17,14,22,17],[17,19,22,21],[17,22,22,24],[17,45,22,48],[17,2,22,2],[14,2,14,26],[14,31,14,44],[14,45,16,48],[15,2,16,2],[17,37,22,41],[17,42,22,44],[17,18,22,18],[19,32,20,36],[20,27,22,30],[21,32,22,36],[17,25,22,26],[17,27,19,30],[17,31,22,31],[17,32,18,36],[23,45,28,48],[23,49,28,51],[25,32,26,36],[27,32,28,36],[23,18,28,18],[23,19,28,21],[23,22,28,24],[23,25,28,26],[23,27,25,30],[23,37,28,41],[23,42,28,44],[17,49,22,51],[29,1,33,1],[29,14,34,17],[29,18,34,18],[23,32,24,36],[29,19,34,21],[29,22,34,24],[29,25,34,26],[23,2,28,2],[29,2,34,2],[23,31,28,31],[26,27,28,30],[23,1,27,1],[23,14,28,17],[29,37,34,41],[29,42,34,44],[29,45,34,48],[29,49,34,51],[31,32,32,36],[32,27,34,30],[33,32,34,36],[29,27,31,30],[29,31,34,31],[29,32,30,36],[35,49,40,51],[37,32,38,36],[38,27,40,30],[39,32,40,36],[35,19,40,21],[35,22,40,24],[35,25,40,26],[35,27,37,30],[35,31,40,31],[35,32,36,36],[41,1,45,1],[41,14,46,17],[41,18,46,18],[35,37,40,41],[35,42,40,44],[35,45,40,48],[35,1,39,1],[35,14,40,17],[35,18,40,18],[35,2,40,2],[41,49,46,51],[43,32,44,36],[44,27,46,30],[45,32,46,36],[41,19,46,21],[41,22,46,24],[41,25,46,26],[41,27,43,30],[41,31,46,31],[41,32,42,36],[47,14,52,17],[47,18,52,18],[47,19,52,21],[41,37,46,41],[41,42,46,44],[41,45,46,48],[47,42,52,44],[47,45,52,48],[41,2,46,2],[47,2,52,2],[47,49,52,51],[49,32,50,36],[50,27,52,30],[51,32,52,36],[47,22,52,24],[47,25,52,26],[47,27,49,30],[47,31,52,31],[47,32,48,36],[47,37,52,41],[53,14,58,17],[53,18,58,18],[53,19,58,21],[59,42,64,44],[59,45,64,48],[59,49,64,51],[61,32,62,36],[62,27,64,30],[63,32,64,36],[53,42,58,44],[53,45,58,48],[53,49,58,51],[55,32,56,36],[56,27,58,30],[57,32,58,36],[53,22,58,24],[53,25,58,26],[53,27,55,30],[53,31,58,31],[53,32,54,36],[53,37,58,41],[59,22,64,24],[59,25,64,26],[59,27,61,30],[59,31,64,31],[59,32,60,36],[59,37,64,41],[69,2,69,22],[69,23,69,51],[65,21,66,23],[65,24,65,40],[65,41,65,51],[66,24,66,40],[66,41,66,51],[68,2,68,22],[68,23,68,51],[65,2,66,5],[65,6,66,11],[65,12,66,12],[65,13,66,16],[65,17,66,19],[65,20,66,20],[59,14,64,17],[59,18,64,18],[59,19,64,21],[53,2,58,2],[59,2,64,2],[15,3,15,7],[16,3,16,9],[16,10,16,13],[17,3,22,9],[17,10,22,13],[23,3,28,9],[23,10,28,13],[29,3,34,9],[29,10,34,13],[35,3,40,9],[35,10,40,13],[41,3,46,9],[41,10,46,13],[47,3,52,9],[47,10,52,13],[53,3,58,9],[53,10,58,13],[59,3,64,9],[59,10,64,13]]}
[]
[]
[null,null,null,null,null,null,null,null,null,null,null,null,null,null,null,null,null,null,null,null,null,null,null,null,null,null,null,null,null,null,null,null,null,null,null,null,null,null,null,null,null,null,null,"機構を経由し賃料のやり取りを行う場合"]
[null,null,null,null,null,null,null,null,null,null,null,null,null,null,null,null,null,null,"農用地利用集積等促進計画（兼申出書）",null,null,null,null,null,null,null,null,null,null,null,null,null,null,null,null,null,null,null,null,null,null,null,null,"物納など、出し手と受け手とで直接賃料の\nやり取りを行う場合"]
[null,null,"１　権利の設定関係"]
[]
[null,null,"整理\n番号\n（受_出）",null,null,"利用権の設定をする者 （出し手）",null,null,null,null,null,null,null,null,null,null,null,null,null,null,null,null,null,null,"〔№",null,"〕",null,"農地中間管理機構",null,null,null,null,"利用権の設定を受ける者 （受け手）",null,null,null,null,null,null,null,null,null,null,null,null,null,"〔№",null,null,"〕"]
[null,null,null,null,null,"〒","000 - 0011",null,null,null,null,null,null,null,"℡(携帯) ",null,null,null,"080 - 0000 - 5555",null,null,null,null,null,null,null,null,null,"〒 810-0001\n　　福岡市中央区天神4-10-12",null,null,null,null,"〒","000 - 0033",null,null,null,null,null,null,"℡(携帯) ",null,null,"090 - 0000 - 8888",null,null,null,null,null,null,null,null,null,null,null,"㊞"]
[null,1,null,null,null,"住 所",null,null,null," 福岡市大字✕✕✕200",null,null,null,null,null,null,null,null,null,null,null,null,null,null,null,null,null,null,null,null,null,null,null,"住 所",null,null,null," 福岡市大字✕✕✕700"]
[null,null,null,null,null,"ﾌﾘｶﾞﾅ ",null,null,null,"ﾃﾝｼﾞﾝ ﾀﾛｳ",null,null,null,null,null,null,null,null,null,null,null,null,null,null,"［ 同意印又は署名 ］",null,null,null,"名称",null,"公益財団法人\n 福岡県農業振興推進機構",null,null,"ﾌﾘｶﾞﾅ ",null,null,null," ﾉｳｼﾞｸﾐｱｲﾎｳｼﾞﾝ ○○ ",null,null,null,null,null,null,null,null,null,"［ 同意印又は署名 ］"]
[null,null,"項",null,null,"氏名\n・名称",null,null,null,"天 神　太 郎",null,null,null,null,null,null,null,null,null,null,null,null,null,null,"㊞または\n天神太郎",null,null,null,null,null,null,null,null,"氏名\n・名称",null,null,null,"農事組合法人 ○○\n　　代表理事　天神 一郎",null,null,null,null,null,null,null,null,null,"㊞または\n農事組合法人○○代表理事　天神 一郎"]
[null,null,null,null,null,null,null,null,null,null,null,null,null,null,null,null,null,null,null,null,null,null,null,null,null,null,null,null,null,null,"理事長　 鐘 江 義 広"]
[null,null,null,"/",null,"e-mail",null,null,null,"tenjin-t＠○○○○○.com",null,null,null,null,null,null,null,null,null,null,null,null,null,null,null,null,null,null," 電話番号 :092-716-8355 ",null,null,null,null,"e-mail",null,null,null,"hojin○○＠○○○○○.jp"]
[null,null,"２　権利を設定する農用地の明細"]
[null,null,"利用権を設定する土地",null,null,null,null,null,null,null,null,null,null,null,null,null,null,null,null,null,null,null,null,null,null,null,null,null,null,null,null,"設定する利用権の内容",null,null,null,null,null,null,null,null,null,null,null,null,null,"備　考",null,null,null,"賃　　料\n端数処理"]
[null,null,"番号","市町村〔",null,null,null,null,"福岡市",null,null,null,null,null,null,null,null,"〕","区分","現況\n地目",null,null,"面積（㎡）",null,null,null,null,"始期",null,null,null,"存続\n期間","権利の種類",null,null,null,null,"賃 料（円）",null,null,null,null,null,null,null,null,null,null,null,null,null,null,null,null,{"$f":"C13","v":0}]
[null,null,null,"大　字",null,null,null,null,null,null,"字",null,null,null,"地　番",null,null,null,null,null,null,null,"台帳",null,null,"取扱",null,"終期",null,null,null,null,null,null,null,null,null,"10a当たり",null,null,null,null,"年 額"]
[null,null,1,"○ ○",null,null,null,null,null,null,"× ×",null,null,null,100,null,null,null,null,"田",null,null,null,null,null,900,null,"R　７ 年　 ６月　１ 日",null,null,null,10,{"$f":"IFERROR(\n    IF(VLOOKUP($A$22,#REF!, 19, FALSE) = \"金納\",\n       \" ■ 金納\",\n       \" □ 金納\" ),\n    \" □ 金納\")","v":" □ 金納"},null,null,null,null,10000,null,null,null,null,9000,null,null,null,null,null,null,{"$f":"IF(OR(ISERROR(AL18), ISERROR(Z18), ISERROR(AQ18), ISNUMBER(AL18) = FALSE, ISNUMBER(Z18) = FALSE, ISNUMBER(AQ18) = FALSE), \"\", IF(AL18 * (Z18 / 1000) <> AQ18, \"〇\", \"\"))","v":""}]
[]
[null,null,null,null,null,null,null,null,null,null,null,null,null,null,null,null,null,null,null,null,null,null,null,null,null,null,null,null,null,null,null,null,{"$f":"IFERROR(\n    IF(VLOOKUP($A$22,#REF!, 19, FALSE) = \"物納\",\n       \" ■ 物納\",\n       \" □ 物納\" ),\n    \" □ 物納\")","v":" □ 物納"}]
{"$rows_left_out":51}
{"sheet":"21 促進計画書 記入例(機構非経由 )","index":2,"n_rows":70,"n_cols":55,"rows_kept":70,"cut":false,"hidden":false,"merged":[[2,43,2,51],[3,18,4,39],[3,42,4,42],[3,43,4,51],[4,2,5,14],[6,2,7,4],[6,5,6,23],[6,26,6,27],[6,28,6,32],[6,33,6,46],[6,48,6,49],[6,50,6,51],[7,6,7,13],[7,14,7,17],[7,18,7,27],[7,28,8,32],[7,34,7,40],[7,41,7,43],[7,44,7,51],[8,5,8,8],[8,9,8,27],[8,33,8,36],[8,37,8,51],[12,37,12,46],[13,2,13,17],[9,37,9,46],[9,47,9,51],[10,2,10,4],[10,5,11,8],[10,9,11,23],[10,24,12,27],[10,33,11,36],[10,37,11,46],[10,47,12,51],[11,30,11,32],[9,2,9,4],[9,5,9,8],[9,9,9,23],[9,24,9,27],[9,28,11,29],[9,30,10,32],[9,33,9,36],[12,5,12,8],[12,9,12,23],[12,28,12,32],[12,33,12,36],[17,45,22,48],[14,2,14,26],[14,31,14,44],[14,45,16,48],[14,49,16,51],[15,8,15,16],[15,18,16,18],[15,19,16,21],[15,22,15,26],[15,27,15,30],[15,31,16,31],[15,32,16,36],[15,37,15,44],[16,14,16,17],[16,22,16,24],[16,25,16,26],[16,27,16,30],[16,37,16,41],[16,42,16,44],[15,2,16,2],[15,3,15,7],[23,19,28,21],[23,22,28,24],[23,25,28,26],[23,27,25,30],[17,1,21,1],[17,14,22,17],[17,18,22,18],[17,19,22,21],[17,22,22,24],[29,1,33,1],[29,14,34,17],[29,18,34,18],[23,32,24,36],[29,19,34,21],[29,22,34,24],[29,25,34,26],[17,49,22,51],[19,32,20,36],[20,27,22,30],[21,32,22,36],[23,1,27,1],[23,14,28,17],[17,25,22,26],[17,27,19,30],[17,31,22,31],[17,32,18,36],[17,37,22,41],[17,42,22,44],[23,45,28,48],[23,49,28,51],[25,32,26,36],[27,32,28,36],[23,18,28,18],[23,37,28,41],[23,42,28,44],[29,37,34,41],[29,42,34,44],[29,45,34,48],[29,49,34,51],[31,32,32,36],[32,27,34,30],[33,32,34,36],[29,27,31,30],[29,31,34,31],[29,32,30,36],[23,31,28,31],[26,27,28,30],[35,49,40,51],[37,32,38,36],[38,27,40,30],[39,32,40,36],[35,19,40,21],[35,22,40,24],[35,25,40,26],[35,27,37,30],[35,31,40,31],[35,32,36,36],[41,1,45,1],[41,14,46,17],[41,18,46,18],[35,37,40,41],[35,42,40,44],[35,45,40,48],[35,1,39,1],[35,14,40,17],[35,18,40,18],[35,2,40,2],[35,3,40,9],[35,10,40,13],[41,49,46,51],[43,32,44,36],[44,27,46,30],[45,32,46,36],[41,19,46,21],[41,22,46,24],[41,25,46,26],[41,27,43,30],[41,31,46,31],[41,32,42,36],[47,14,52,17],[47,18,52,18],[47,19,52,21],[41,37,46,41],[41,42,46,44],[41,45,46,48],[47,42,52,44],[47,45,52,48],[41,2,46,2],[41,3,46,9],[41,10,46,13],[47,2,52,2],[47,3,52,9],[47,10,52,13],[47,49,52,51],[49,32,50,36],[50,27,52,30],[51,32,52,36],[47,22,52,24],[47,25,52,26],[47,27,49,30],[47,31,52,31],[47,32,48,36],[47,37,52,41],[53,14,58,17],[53,18,58,18],[53,19,58,21],[59,42,64,44],[59,45,64,48],[59,49,64,51],[61,32,62,36],[62,27,64,30],[63,32,64,36],[53,42,58,44],[53,45,58,48],[53,49,58,51],[55,32,56,36],[56,27,58,30],[57,32,58,36],[53,22,58,24],[53,25,58,26],[53,27,55,30],[53,31,58,31],[53,32,54,36],[53,37,58,41],[59,22,64,24],[59,25,64,26],[59,27,61,30],[59,31,64,31],[59,32,60,36],[59,37,64,41],[69,2,69,22],[69,23,69,51],[65,21,66,23],[65,24,65,40],[65,41,65,51],[66,24,66,40],[66,41,66,51],[68,2,68,22],[68,23,68,51],[65,2,66,5],[65,6,66,11],[65,12,66,12],[65,13,66,16],[65,17,66,19],[65,20,66,20],[59,14,64,17],[59,18,64,18],[59,19,64,21],[53,2,58,2],[53,3,58,9],[53,10,58,13],[59,2,64,2],[59,3,64,9],[59,10,64,13],[16,3,16,9],[16,10,16,13],[17,2,22,2],[17,3,22,9],[17,10,22,13],[23,2,28,2],[23,3,28,9],[23,10,28,13],[29,2,34,2],[29,3,34,9],[29,10,34,13]]}
[]
[]
[null,null,null,null,null,null,null,null,null,null,null,null,null,null,null,null,null,null,null,null,null,null,null,null,null,null,null,null,null,null,null,null,null,null,null,null,null,null,null,null,null,null,null,"機構を経由し賃料のやり取りを行う場合"]
[null,null,null,null,null,null,null,null,null,null,null,null,null,null,null,null,null,null,"農用地利用集積等促進計画（兼申出書）",null,null,null,null,null,null,null,null,null,null,null,null,null,null,null,null,null,null,null,null,null,null,null,null,"物納など、出し手と受け手とで直接賃料の\nやり取りを行う場合"]
[null,null,"１　権利の設定関係"]
[]
[null,null,"整理\n番号\n（受_出）",null,null,"利用権の設定をする者 （出し手）",null,null,null,null,null,null,null,null,null,null,null,null,null,null,null,null,null,null,"〔№",null,"〕",null,"農地中間管理機構",null,null,null,null,"利用権の設定を受ける者 （受け手）",null,null,null,null,null,null,null,null,null,null,null,null,null,"〔№",null,null,"〕"]
[null,null,null,null,null,"〒","000 - 0011",null,null,null,null,null,null,null,"℡(携帯) ",null,null,null,"090 - 0000 - 1111",null,null,null,null,null,null,null,null,null,"〒 810-0001\n　　福岡市中央区天神4-10-12",null,null,null,null,"〒","000 - 0033",null,null,null,null,null,null,"℡(携帯) ",null,null,"090 - 0000 - 9999"]
[null,1,null,null,null,"住 所",null,null,null," 福岡市大字✕✕✕300",null,null,null,null,null,null,null,null,null,null,null,null,null,null,null,null,null,null,null,null,null,null,null,"住 所",null,null,null," 福岡市大字✕✕✕500"]
[null,null,null,null,null,"ﾌﾘｶﾞﾅ ",null,null,null," ﾌｸｵｶ ｲﾁﾛｳ",null,null,null,null,null,null,null,null,null,null,null,null,null,null,"［ 同意印又は署名 ］",null,null,null,"名称",null,"公益財団法人\n 福岡県農業振興推進機構",null,null,"ﾌﾘｶﾞﾅ ",null,null,null," ﾊｶﾀ ｼﾞﾛｳ",null,null,null,null,null,null,null,null,null,"［ 同意印又は署名 ］"]
[null,null,"項",null,null,"氏名\n・名称",null,null,null," 福 岡　一 郎",null,null,null,null,null,null,null,null,null,null,null,null,null,null,"㊞または\n福岡一郎",null,null,null,null,null,null,null,null,"氏名\n・名称",null,null,null," 博 多　二 郎",null,null,null,null,null,null,null,null,null,"㊞または\n博多二郎"]
[null,null,null,null,null,null,null,null,null,null,null,null,null,null,null,null,null,null,null,null,null,null,null,null,null,null,null,null,null,null,"理事長　 鐘 江 義 広"]
[null,null,null,"/",null,"e-mail",null,null,null,"fukuoka-i＠○○○○○.lg.jp",null,null,null,null,null,null,null,null,null,null,null,null,null,null,null,null,null,null," 電話番号 :092-716-8355 ",null,null,null,null,"e-mail",null,null,null,"hakata-j○○＠○○○○○.jp"]
[null,null,"２　権利を設定する農用地の明細"]
[null,null,"利用権を設定する土地",null,null,null,null,null,null,null,null,null,null,null,null,null,null,null,null,null,null,null,null,null,null,null,null,null,null,null,null,"設定する利用権の内容",null,null,null,null,null,null,null,null,null,null,null,null,null,"備　考",null,null,null,"賃　　料\n端数処理"]
[null,null,"番号","市町村〔",null,null,null,null,"福岡市",null,null,null,null,null,null,null,null,"〕","区分","現況\n地目",null,null,"面積（㎡）",null,null,null,null,"始期",null,null,null,"存続\n期間","権利の種類",null,null,null,null,"賃 料（円）",null,null,null,null,null,null,null,null,null,null,null,null,null,null,null,null,{"$f":"C13","v":0}]
[null,null,null,"大　字",null,null,null,null,null,null,"字",null,null,null,"地　番",null,null,null,null,null,null,null,"台帳",null,null,"取扱",null,"終期",null,null,null,null,null,null,null,null,null,"10a当たり",null,null,null,null,"年 額"]
[null,null,1,"○ ○",null,null,null,null,null,null,"× ×",null,null,null,100,null,null,null,null,"田",null,null,null,null,null,800,null,"R　７ 年　 ６月　１ 日",null,null,null,10,{"$f":"IFERROR(\n    IF(VLOOKUP($A$22,#REF!, 19, FALSE) = \"金納\",\n       \" ■ 金納\",\n       \" □ 金納\" ),\n    \" □ 金納\")","v":" □ 金納"},null,null,null,null,null,null,null,null,null,null,null,null,null,null,null,null,{"$f":"IF(OR(ISERROR(AL18), ISERROR(Z18), ISERROR(AQ18), ISNUMBER(AL18) = FALSE, ISNUMBER(Z18) = FALSE, ISNUMBER(AQ18) = FALSE), \"\", IF(AL18 * (Z18 / 1000) <> AQ18, \"〇\", \"\"))","v":""}]
[]
[null,null,null,null,null,null,null,null,null,null,null,null,null,null,null,null,null,null,null,null,null,null,null,null,null,null,null,null,null,null,null,null,{"$f":"IFERROR(\n    IF(VLOOKUP($A$22,#REF!, 19, FALSE) = \"物納\",\n       \" ■ 物納\",\n       \" □ 物納\" ),\n    \" □ 物納\")","v":" □ 物納"}]
{"$rows_left_out":50}